{"text_format":"1","workbook":"xlsx","n_sheets":5,"sheets":["TIMELINE","EVENTS","CALENDAR","PRINT VERSION","Months"],"not_rendered":{"charts":1,"images":0,"macros":1,"external_links":0,"defined_names":18,"comments":0,"pivot_tables":0},"unopened":[],"bounds":{"document_bytes":16777216,"sheet_cells":100000,"rows_first":2000,"rows_last":500,"rows_between":2000,"halvings":0,"cell_chars":16384,"cell_head_chars":4096},"cells_cut":0,"cells_raw":0,"read":"whole","date_system":"1900"}

{"sheet":"TIMELINE","index":0,"n_rows":2,"n_cols":2,"rows_kept":2,"cut":false,"hidden":false,"merged":[]}
[]
[null,"YEARLY HOLIDAY TIMELINE"]

{"sheet":"EVENTS","index":1,"n_rows":15,"n_cols":7,"rows_kept":15,"cut":false,"hidden":false,"merged":[]}
[]
[null,"MONTHLY HOLIDAY PLANNER"]
[]
[null,"DATE","DAY","MONTH","EVENT NAME","DAYS TO GO","HEIGHT"]
[null,"2017-04-23",{"$f":"IF(ISBLANK(tblEvents[[#This Row],[DATE]]),\"\",UPPER(TEXT(tblEvents[[#This Row],[DATE]],\"ddd\")))","v":"SUN"},{"$f":"IF(ISBLANK(tblEvents[[#This Row],[DATE]]),\"\",UPPER(TEXT(tblEvents[[#This Row],[DATE]],\"mmm\")))","v":"APR"}," Lailat al Miraj",{"$f":"tblEvents[[#This Row],[DATE]]-TODAY()","v":178},100]
[null,"2017-05-11",{"$f":"IF(ISBLANK(tblEvents[[#This Row],[DATE]]),\"\",UPPER(TEXT(tblEvents[[#This Row],[DATE]],\"ddd\")))","v":"THU"},{"$f":"IF(ISBLANK(tblEvents[[#This Row],[DATE]]),\"\",UPPER(TEXT(tblEvents[[#This Row],[DATE]],\"mmm\")))","v":"MAY"}," Lailat al Bara'ah",{"$f":"tblEvents[[#This Row],[DATE]]-TODAY()","v":196},140]
[null,"2017-05-27",{"$f":"IF(ISBLANK(tblEvents[[#This Row],[DATE]]),\"\",UPPER(TEXT(tblEvents[[#This Row],[DATE]],\"ddd\")))","v":"SAT"},{"$f":"IF(ISBLANK(tblEvents[[#This Row],[DATE]]),\"\",UPPER(TEXT(tblEvents[[#This Row],[DATE]],\"mmm\")))","v":"MAY"}," Ramadan (start)",{"$f":"tblEvents[[#This Row],[DATE]]-TODAY()","v":212},-200]
[null,"2017-06-21",{"$f":"IF(ISBLANK(tblEvents[[#This Row],[DATE]]),\"\",UPPER(TEXT(tblEvents[[#This Row],[DATE]],\"ddd\")))","v":"WED"},{"$f":"IF(ISBLANK(tblEvents[[#This Row],[DATE]]),\"\",UPPER(TEXT(tblEvents[[#This Row],[DATE]],\"mmm\")))","v":"JUN"}," Laylat al Kadr",{"$f":"tblEvents[[#This Row],[DATE]]-TODAY()","v":237},-120]
[null,"2017-06-23",{"$f":"IF(ISBLANK(tblEvents[[#This Row],[DATE]]),\"\",UPPER(TEXT(tblEvents[[#This Row],[DATE]],\"ddd\")))","v":"FRI"},{"$f":"IF(ISBLANK(tblEvents[[#This Row],[DATE]]),\"\",UPPER(TEXT(tblEvents[[#This Row],[DATE]],\"mmm\")))","v":"JUN"},"Quds Day",{"$f":"tblEvents[[#This Row],[DATE]]-TODAY()","v":239},160]
[null,"2017-06-27",{"$f":"IF(ISBLANK(tblEvents[[#This Row],[DATE]]),\"\",UPPER(TEXT(tblEvents[[#This Row],[DATE]],\"ddd\")))","v":"TUE"},{"$f":"IF(ISBLANK(tblEvents[[#This Row],[DATE]]),\"\",UPPER(TEXT(tblEvents[[#This Row],[DATE]],\"mmm\")))","v":"JUN"}," Eid-al-Fitr (End of Ramadan)",{"$f":"tblEvents[[#This Row],[DATE]]-TODAY()","v":243},110]
[null,"2017-08-31",{"$f":"IF(ISBLANK(tblEvents[[#This Row],[DATE]]),\"\",UPPER(TEXT(tblEvents[[#This Row],[DATE]],\"ddd\")))","v":"THU"},{"$f":"IF(ISBLANK(tblEvents[[#This Row],[DATE]]),\"\",UPPER(TEXT(tblEvents[[#This Row],[DATE]],\"mmm\")))","v":"AUG"}," Waqf al Arafa - Hajj",{"$f":"tblEvents[[#This Row],[DATE]]-TODAY()","v":308},90]
[null,"2017-09-04",{"$f":"IF(ISBLANK(tblEvents[[#This Row],[DATE]]),\"\",UPPER(TEXT(tblEvents[[#This Row],[DATE]],\"ddd\")))","v":"MON"},{"$f":"IF(ISBLANK(tblEvents[[#This Row],[DATE]]),\"\",UPPER(TEXT(tblEvents[[#This Row],[DATE]],\"mmm\")))","v":"SEP"}," Eid-al-Adha",{"$f":"tblEvents[[#This Row],[DATE]]-TODAY()","v":312},-60]
[null,"2017-09-21",{"$f":"IF(ISBLANK(tblEvents[[#This Row],[DATE]]),\"\",UPPER(TEXT(tblEvents[[#This Row],[DATE]],\"ddd\")))","v":"THU"},{"$f":"IF(ISBLANK(tblEvents[[#This Row],[DATE]]),\"\",UPPER(TEXT(tblEvents[[#This Row],[DATE]],\"mmm\")))","v":"SEP"}," Hijra - Islamic New Year",{"$f":"tblEvents[[#This Row],[DATE]]-TODAY()","v":329},-160]
[null,"2017-10-01",{"$f":"IF(ISBLANK(tblEvents[[#This Row],[DATE]]),\"\",UPPER(TEXT(tblEvents[[#This Row],[DATE]],\"ddd\")))","v":"SUN"},{"$f":"IF(ISBLANK(tblEvents[[#This Row],[DATE]]),\"\",UPPER(TEXT(tblEvents[[#This Row],[DATE]],\"mmm\")))","v":"OCT"}," Day of Ashura /Muharram",{"$f":"tblEvents[[#This Row],[DATE]]-TODAY()","v":339},50]
[null,"2017-12-01",{"$f":"IF(ISBLANK(tblEvents[[#This Row],[DATE]]),\"\",UPPER(TEXT(tblEvents[[#This Row],[DATE]],\"ddd\")))","v":"FRI"},{"$f":"IF(ISBLANK(tblEvents[[#This Row],[DATE]]),\"\",UPPER(TEXT(tblEvents[[#This Row],[DATE]],\"mmm\")))","v":"DEC"}," Milad un Nabi",{"$f":"tblEvents[[#This Row],[DATE]]-TODAY()","v":400},-50]

{"sheet":"CALENDAR","index":2,"n_rows":35,"n_cols":21,"rows_kept":35,"cut":false,"hidden":false,"merged":[[1,5,1,8],[34,8,34,20],[33,8,33,20],[32,8,32,20],[31,8,31,20],[30,11,30,20]]}
[]
[null,null,2017,null,null,{"$f":"LOOKUP(MonthNum,tblMonths[NUMBER],tblMonths[MONTH])","v":"APRIL"}]
[null,null,4,null,null,{"$f":"DATE(ViewYear,MonthNum,1)","v":"2017-04-01"},null,null,{"$f":"WEEKDAY(StartDate)","v":7}]
[null,null,"SUN",null,null,"MON",null,null,"TUE",null,null,"WED",null,null,"THU",null,null,"FRI",null,null,"SAT"]
[]
[null,null,{"$f":"StartDate-(WEEKDAY(StartDate)-1)+{0;1;2;3;4;5}*7 +{1,2,3,4,5,6,7}-3+COLUMN(B1)","v":"2017-03-26"},null,null,{"$f":"StartDate-(WEEKDAY(StartDate)-1)+{0;1;2;3;4;5}*7 +{1,2,3,4,5,6,7}-3+COLUMN(C1)","v":"2017-03-27"},null,null,{"$f":"StartDate-(WEEKDAY(StartDate)-1)+{0;1;2;3;4;5}*7 +{1,2,3,4,5,6,7}-3+COLUMN(D1)","v":"2017-03-28"},null,null,{"$f":"StartDate-(WEEKDAY(StartDate)-1)+{0;1;2;3;4;5}*7 +{1,2,3,4,5,6,7}-3+COLUMN(E1)","v":"2017-03-29"},null,null,{"$f":"StartDate-(WEEKDAY(StartDate)-1)+{0;1;2;3;4;5}*7 +{1,2,3,4,5,6,7}-3+COLUMN(F1)","v":"2017-03-30"},null,null,{"$f":"StartDate-(WEEKDAY(StartDate)-1)+{0;1;2;3;4;5}*7 +{1,2,3,4,5,6,7}-3+COLUMN(G1)","v":"2017-03-31"},null,null,{"$f":"StartDate-(WEEKDAY(StartDate)-1)+{0;1;2;3;4;5}*7 +{1,2,3,4,5,6,7}-3+COLUMN(H1)","v":"2017-04-01"}]
[null,null,{"$f":"IFERROR(INDEX(tblEvents[],SMALL(IF(Dates=C$6,ROW(Dates)),ROW(1:1))-TableRowStart,4),\"\")","v":""},null,null,{"$f":"IFERROR(INDEX(tblEvents[],SMALL(IF(Dates=F$6,ROW(Dates)),ROW(1:1))-TableRowStart,4),\"\")","v":""},null,null,{"$f":"IFERROR(INDEX(tblEvents[],SMALL(IF(Dates=I$6,ROW(Dates)),ROW(1:1))-TableRowStart,4),\"\")","v":""},null,null,{"$f":"IFERROR(INDEX(tblEvents[],SMALL(IF(Dates=L$6,ROW(Dates)),ROW(1:1))-TableRowStart,4),\"\")","v":""},null,null,{"$f":"IFERROR(INDEX(tblEvents[],SMALL(IF(Dates=O$6,ROW(Dates)),ROW(1:1))-TableRowStart,4),\"\")","v":""},null,null,{"$f":"IFERROR(INDEX(tblEvents[],SMALL(IF(Dates=R$6,ROW(Dates)),ROW(1:1))-TableRowStart,4),\"\")","v":""},null,null,{"$f":"IFERROR(INDEX(tblEvents[],SMALL(IF(Dates=U$6,ROW(Dates)),ROW(1:1))-TableRowStart,4),\"\")","v":""}]
[null,null,{"$f":"IFERROR(INDEX(tblEvents[],SMALL(IF(Dates=C$6,ROW(Dates)),ROW(2:2))-TableRowStart,4),\"\")","v":""},null,null,{"$f":"IFERROR(INDEX(tblEvents[],SMALL(IF(Dates=F$6,ROW(Dates)),ROW(2:2))-TableRowStart,4),\"\")","v":""},null,null,{"$f":"IFERROR(INDEX(tblEvents[],SMALL(IF(Dates=I$6,ROW(Dates)),ROW(2:2))-TableRowStart,4),\"\")","v":""},null,null,{"$f":"IFERROR(INDEX(tblEvents[],SMALL(IF(Dates=L$6,ROW(Dates)),ROW(2:2))-TableRowStart,4),\"\")","v":""},null,null,{"$f":"IFERROR(INDEX(tblEvents[],SMALL(IF(Dates=O$6,ROW(Dates)),ROW(2:2))-TableRowStart,4),\"\")","v":""},null,null,{"$f":"IFERROR(INDEX(tblEvents[],SMALL(IF(Dates=R$6,ROW(Dates)),ROW(2:2))-TableRowStart,4),\"\")","v":""},null,null,{"$f":"IFERROR(INDEX(tblEvents[],SMALL(IF(Dates=U$6,ROW(Dates)),ROW(2:2))-TableRowStart,4),\"\")","v":""}]
[null,null,{"$f":"IFERROR(INDEX(tblEvents[],SMALL(IF(Dates=C$6,ROW(Dates)),ROW(3:3))-TableRowStart,4),\"\")","v":""},null,null,{"$f":"IFERROR(INDEX(tblEvents[],SMALL(IF(Dates=F$6,ROW(Dates)),ROW(3:3))-TableRowStart,4),\"\")","v":""},null,null,{"$f":"IFERROR(INDEX(tblEvents[],SMALL(IF(Dates=I$6,ROW(Dates)),ROW(3:3))-TableRowStart,4),\"\")","v":""},null,null,{"$f":"IFERROR(INDEX(tblEvents[],SMALL(IF(Dates=L$6,ROW(Dates)),ROW(3:3))-TableRowStart,4),\"\")","v":""},null,null,{"$f":"IFERROR(INDEX(tblEvents[],SMALL(IF(Dates=O$6,ROW(Dates)),ROW(3:3))-TableRowStart,4),\"\")","v":""},null,null,{"$f":"IFERROR(INDEX(tblEvents[],SMALL(IF(Dates=R$6,ROW(Dates)),ROW(3:3))-TableRowStart,4),\"\")","v":""},null,null,{"$f":"IFERROR(INDEX(tblEvents[],SMALL(IF(Dates=U$6,ROW(Dates)),ROW(3:3))-TableRowStart,4),\"\")","v":""}]
[null,null,{"$f":"IFERROR(INDEX(tblEvents[],SMALL(IF(Dates=C$6,ROW(Dates)),ROW(#REF!))-TableRowStart,4),\"\")","v":""},null,null,{"$f":"IFERROR(INDEX(tblEvents[],SMALL(IF(Dates=F$6,ROW(Dates)),ROW(#REF!))-TableRowStart,4),\"\")","v":""},null,null,{"$f":"IFERROR(INDEX(tblEvents[],SMALL(IF(Dates=I$6,ROW(Dates)),ROW(#REF!))-TableRowStart,4),\"\")","v":""},null,null,{"$f":"IFERROR(INDEX(tblEvents[],SMALL(IF(Dates=L$6,ROW(Dates)),ROW(#REF!))-TableRowStart,4),\"\")","v":""},null,null,{"$f":"IFERROR(INDEX(tblEvents[],SMALL(IF(Dates=O$6,ROW(Dates)),ROW(#REF!))-TableRowStart,4),\"\")","v":""},null,null,{"$f":"IFERROR(INDEX(tblEvents[],SMALL(IF(Dates=R$6,ROW(Dates)),ROW(#REF!))-TableRowStart,4),\"\")","v":""},null,null,{"$f":"IFERROR(INDEX(tblEvents[],SMALL(IF(Dates=U$6,ROW(Dates)),ROW(#REF!))-TableRowStart,4),\"\")","v":""}]
[null,null,{"$f":"U6+1","v":"2017-04-02"},null,null,{"$f":"C11+1","v":"2017-04-03"},null,null,{"$f":"F11+1","v":"2017-04-04"},null,null,{"$f":"I11+1","v":"2017-04-05"},null,null,{"$f":"L11+1","v":"2017-04-06"},null,null,{"$f":"O11+1","v":"2017-04-07"},null,null,{"$f":"R11+1","v":"2017-04-08"}]
[null,null,{"$f":"IFERROR(INDEX(tblEvents[],SMALL(IF(Dates=C$11,ROW(Dates)),ROW(1:1))-TableRowStart,4),\"\")","v":""},null,null,{"$f":"IFERROR(INDEX(tblEvents[],SMALL(IF(Dates=F$11,ROW(Dates)),ROW(1:1))-TableRowStart,4),\"\")","v":""},null,null,{"$f":"IFERROR(INDEX(tblEvents[],SMALL(IF(Dates=I$11,ROW(Dates)),ROW(1:1))-TableRowStart,4),\"\")","v":""},null,null,{"$f":"IFERROR(INDEX(tblEvents[],SMALL(IF(Dates=L$11,ROW(Dates)),ROW(1:1))-TableRowStart,4),\"\")","v":""},null,null,{"$f":"IFERROR(INDEX(tblEvents[],SMALL(IF(Dates=O$11,ROW(Dates)),ROW(1:1))-TableRowStart,4),\"\")","v":""},null,null,{"$f":"IFERROR(INDEX(tblEvents[],SMALL(IF(Dates=R$11,ROW(Dates)),ROW(1:1))-TableRowStart,4),\"\")","v":""},null,null,{"$f":"IFERROR(INDEX(tblEvents[],SMALL(IF(Dates=U$11,ROW(Dates)),ROW(1:1))-TableRowStart,4),\"\")","v":""}]
[null,null,{"$f":"IFERROR(INDEX(tblEvents[],SMALL(IF(Dates=C$11,ROW(Dates)),ROW(2:2))-TableRowStart,4),\"\")","v":""},null,null,{"$f":"IFERROR(INDEX(tblEvents[],SMALL(IF(Dates=F$11,ROW(Dates)),ROW(2:2))-TableRowStart,4),\"\")","v":""},null,null,{"$f":"IFERROR(INDEX(tblEvents[],SMALL(IF(Dates=I$11,ROW(Dates)),ROW(2:2))-TableRowStart,4),\"\")","v":""},null,null,{"$f":"IFERROR(INDEX(tblEvents[],SMALL(IF(Dates=L$11,ROW(Dates)),ROW(2:2))-TableRowStart,4),\"\")","v":""},null,null,{"$f":"IFERROR(INDEX(tblEvents[],SMALL(IF(Dates=O$11,ROW(Dates)),ROW(2:2))-TableRowStart,4),\"\")","v":""},null,null,{"$f":"IFERROR(INDEX(tblEvents[],SMALL(IF(Dates=R$11,ROW(Dates)),ROW(2:2))-TableRowStart,4),\"\")","v":""},null,null,{"$f":"IFERROR(INDEX(tblEvents[],SMALL(IF(Dates=U$11,ROW(Dates)),ROW(2:2))-TableRowStart,4),\"\")","v":""}]
[null,null,{"$f":"IFERROR(INDEX(tblEvents[],SMALL(IF(Dates=C$11,ROW(Dates)),ROW(3:3))-TableRowStart,4),\"\")","v":""},null,null,{"$f":"IFERROR(INDEX(tblEvents[],SMALL(IF(Dates=F$11,ROW(Dates)),ROW(3:3))-TableRowStart,4),\"\")","v":""},null,null,{"$f":"IFERROR(INDEX(tblEvents[],SMALL(IF(Dates=I$11,ROW(Dates)),ROW(3:3))-TableRowStart,4),\"\")","v":""},null,null,{"$f":"IFERROR(INDEX(tblEvents[],SMALL(IF(Dates=L$11,ROW(Dates)),ROW(3:3))-TableRowStart,4),\"\")","v":""},null,null,{"$f":"IFERROR(INDEX(tblEvents[],SMALL(IF(Dates=O$11,ROW(Dates)),ROW(3:3))-TableRowStart,4),\"\")","v":""},null,null,{"$f":"IFERROR(INDEX(tblEvents[],SMALL(IF(Dates=R$11,ROW(Dates)),ROW(3:3))-TableRowStart,4),\"\")","v":""},null,null,{"$f":"IFERROR(INDEX(tblEvents[],SMALL(IF(Dates=U$11,ROW(Dates)),ROW(3:3))-TableRowStart,4),\"\")","v":""}]
[null,null,{"$f":"IFERROR(INDEX(tblEvents[],SMALL(IF(Dates=C$11,ROW(Dates)),ROW(#REF!))-TableRowStart,4),\"\")","v":""},null,null,{"$f":"IFERROR(INDEX(tblEvents[],SMALL(IF(Dates=F$11,ROW(Dates)),ROW(#REF!))-TableRowStart,4),\"\")","v":""},null,null,{"$f":"IFERROR(INDEX(tblEvents[],SMALL(IF(Dates=I$11,ROW(Dates)),ROW(#REF!))-TableRowStart,4),\"\")","v":""},null,null,{"$f":"IFERROR(INDEX(tblEvents[],SMALL(IF(Dates=L$11,ROW(Dates)),ROW(#REF!))-TableRowStart,4),\"\")","v":""},null,null,{"$f":"IFERROR(INDEX(tblEvents[],SMALL(IF(Dates=O$11,ROW(Dates)),ROW(#REF!))-TableRowStart,4),\"\")","v":""},null,null,{"$f":"IFERROR(INDEX(tblEvents[],SMALL(IF(Dates=R$11,ROW(Dates)),ROW(#REF!))-TableRowStart,4),\"\")","v":""},null,null,{"$f":"IFERROR(INDEX(tblEvents[],SMALL(IF(Dates=U$11,ROW(Dates)),ROW(#REF!))-TableRowStart,4),\"\")","v":""}]
[null,null,{"$f":"U11+1","v":"2017-04-09"},null,null,{"$f":"C16+1","v":"2017-04-10"},null,null,{"$f":"F16+1","v":"2017-04-11"},null,null,{"$f":"I16+1","v":"2017-04-12"},null,null,{"$f":"L16+1","v":"2017-04-13"},null,null,{"$f":"O16+1","v":"2017-04-14"},null,null,{"$f":"R16+1","v":"2017-04-15"}]
[null,null,{"$f":"IFERROR(INDEX(tblEvents[],SMALL(IF(Dates=C$16,ROW(Dates)),ROW(1:1))-TableRowStart,4),\"\")","v":""},null,null,{"$f":"IFERROR(INDEX(tblEvents[],SMALL(IF(Dates=F$16,ROW(Dates)),ROW(1:1))-TableRowStart,4),\"\")","v":""},null,null,{"$f":"IFERROR(INDEX(tblEvents[],SMALL(IF(Dates=I$16,ROW(Dates)),ROW(1:1))-TableRowStart,4),\"\")","v":""},null,null,{"$f":"IFERROR(INDEX(tblEvents[],SMALL(IF(Dates=L$16,ROW(Dates)),ROW(1:1))-TableRowStart,4),\"\")","v":""},null,null,{"$f":"IFERROR(INDEX(tblEvents[],SMALL(IF(Dates=O$16,ROW(Dates)),ROW(1:1))-TableRowStart,4),\"\")","v":""},null,null,{"$f":"IFERROR(INDEX(tblEvents[],SMALL(IF(Dates=R$16,ROW(Dates)),ROW(1:1))-TableRowStart,4),\"\")","v":""},null,null,{"$f":"IFERROR(INDEX(tblEvents[],SMALL(IF(Dates=U$16,ROW(Dates)),ROW(1:1))-TableRowStart,4),\"\")","v":""}]
[null,null,{"$f":"IFERROR(INDEX(tblEvents[],SMALL(IF(Dates=C$16,ROW(Dates)),ROW(2:2))-TableRowStart,4),\"\")","v":""},null,null,{"$f":"IFERROR(INDEX(tblEvents[],SMALL(IF(Dates=F$16,ROW(Dates)),ROW(2:2))-TableRowStart,4),\"\")","v":""},null,null,{"$f":"IFERROR(INDEX(tblEvents[],SMALL(IF(Dates=I$16,ROW(Dates)),ROW(2:2))-TableRowStart,4),\"\")","v":""},null,null,{"$f":"IFERROR(INDEX(tblEvents[],SMALL(IF(Dates=L$16,ROW(Dates)),ROW(2:2))-TableRowStart,4),\"\")","v":""},null,null,{"$f":"IFERROR(INDEX(tblEvents[],SMALL(IF(Dates=O$16,ROW(Dates)),ROW(2:2))-TableRowStart,4),\"\")","v":""},null,null,{"$f":"IFERROR(INDEX(tblEvents[],SMALL(IF(Dates=R$16,ROW(Dates)),ROW(2:2))-TableRowStart,4),\"\")","v":""},null,null,{"$f":"IFERROR(INDEX(tblEvents[],SMALL(IF(Dates=U$16,ROW(Dates)),ROW(2:2))-TableRowStart,4),\"\")","v":""}]
[null,null,{"$f":"IFERROR(INDEX(tblEvents[],SMALL(IF(Dates=C$16,ROW(Dates)),ROW(3:3))-TableRowStart,4),\"\")","v":""},null,null,{"$f":"IFERROR(INDEX(tblEvents[],SMALL(IF(Dates=F$16,ROW(Dates)),ROW(3:3))-TableRowStart,4),\"\")","v":""},null,null,{"$f":"IFERROR(INDEX(tblEvents[],SMALL(IF(Dates=I$16,ROW(Dates)),ROW(3:3))-TableRowStart,4),\"\")","v":""},null,null,{"$f":"IFERROR(INDEX(tblEvents[],SMALL(IF(Dates=L$16,ROW(Dates)),ROW(3:3))-TableRowStart,4),\"\")","v":""},null,null,{"$f":"IFERROR(INDEX(tblEvents[],SMALL(IF(Dates=O$16,ROW(Dates)),ROW(3:3))-TableRowStart,4),\"\")","v":""},null,null,{"$f":"IFERROR(INDEX(tblEvents[],SMALL(IF(Dates=R$16,ROW(Dates)),ROW(3:3))-TableRowStart,4),\"\")","v":""},null,null,{"$f":"IFERROR(INDEX(tblEvents[],SMALL(IF(Dates=U$16,ROW(Dates)),ROW(3:3))-TableRowStart,4),\"\")","v":""}]
[null,null,{"$f":"IFERROR(INDEX(tblEvents[],SMALL(IF(Dates=C$16,ROW(Dates)),ROW(#REF!))-TableRowStart,4),\"\")","v":""},null,null,{"$f":"IFERROR(INDEX(tblEvents[],SMALL(IF(Dates=F$16,ROW(Dates)),ROW(#REF!))-TableRowStart,4),\"\")","v":""},null,null,{"$f":"IFERROR(INDEX(tblEvents[],SMALL(IF(Dates=I$16,ROW(Dates)),ROW(#REF!))-TableRowStart,4),\"\")","v":""},null,null,{"$f":"IFERROR(INDEX(tblEvents[],SMALL(IF(Dates=L$16,ROW(Dates)),ROW(#REF!))-TableRowStart,4),\"\")","v":""},null,null,{"$f":"IFERROR(INDEX(tblEvents[],SMALL(IF(Dates=O$16,ROW(Dates)),ROW(#REF!))-TableRowStart,4),\"\")","v":""},null,null,{"$f":"IFERROR(INDEX(tblEvents[],SMALL(IF(Dates=R$16,ROW(Dates)),ROW(#REF!))-TableRowStart,4),\"\")","v":""},null,null,{"$f":"IFERROR(INDEX(tblEvents[],SMALL(IF(Dates=U$16,ROW(Dates)),ROW(#REF!))-TableRowStart,4),\"\")","v":""}]
{"$rows_left_out":16}
{"sheet":"PRINT VERSION","index":3,"n_rows":35,"n_cols":21,"rows_kept":35,"cut":false,"hidden":false,"merged":[[1,5,1,11],[30,8,34,20]]}
[]
[null,null,{"$f":"ViewYear","v":2017},null,null,{"$f":"ViewMonth","v":"APRIL"},{"$f":"CALENDAR!G2","v":0},{"$f":"CALENDAR!H2","v":0},{"$f":"CALENDAR!I2","v":0},{"$f":"CALENDAR!J2","v":0},{"$f":"CALENDAR!K2","v":0},{"$f":"CALENDAR!L2","v":0}]
[]
[null,null,"SUN",null,null,"MON",null,null,"TUE",null,null,"WED",null,null,"THU",null,null,"FRI",null,null,"SAT"]
[]
[null,null,{"$f":"CALENDAR!C6","v":"2017-03-26"},{"$f":"CALENDAR!D6","v":0},{"$f":"CALENDAR!E6","v":0},{"$f":"CALENDAR!F6","v":"2017-03-27"},{"$f":"CALENDAR!G6","v":0},{"$f":"CALENDAR!H6","v":0},{"$f":"CALENDAR!I6","v":"2017-03-28"},{"$f":"CALENDAR!J6","v":0},{"$f":"CALENDAR!K6","v":0},{"$f":"CALENDAR!L6","v":"2017-03-29"},{"$f":"CALENDAR!M6","v":0},{"$f":"CALENDAR!N6","v":0},{"$f":"CALENDAR!O6","v":"2017-03-30"},{"$f":"CALENDAR!P6","v":0},{"$f":"CALENDAR!Q6","v":0},{"$f":"CALENDAR!R6","v":"2017-03-31"},{"$f":"CALENDAR!S6","v":0},{"$f":"CALENDAR!T6","v":0},{"$f":"CALENDAR!U6","v":"2017-04-01"}]
[null,null,{"$f":"CALENDAR!C7","v":""},{"$f":"CALENDAR!D7","v":0},{"$f":"CALENDAR!E7","v":0},{"$f":"CALENDAR!F7","v":""},{"$f":"CALENDAR!G7","v":0},{"$f":"CALENDAR!H7","v":0},{"$f":"CALENDAR!I7","v":""},{"$f":"CALENDAR!J7","v":0},{"$f":"CALENDAR!K7","v":0},{"$f":"CALENDAR!L7","v":""},{"$f":"CALENDAR!M7","v":0},{"$f":"CALENDAR!N7","v":0},{"$f":"CALENDAR!O7","v":""},{"$f":"CALENDAR!P7","v":0},{"$f":"CALENDAR!Q7","v":0},{"$f":"CALENDAR!R7","v":""},{"$f":"CALENDAR!S7","v":0},{"$f":"CALENDAR!T7","v":0},{"$f":"CALENDAR!U7","v":""}]
[null,null,{"$f":"CALENDAR!C8","v":""},{"$f":"CALENDAR!D8","v":"00:00:00"},{"$f":"CALENDAR!E8","v":"00:00:00"},{"$f":"CALENDAR!F8","v":""},{"$f":"CALENDAR!G8","v":"00:00:00"},{"$f":"CALENDAR!H8","v":"00:00:00"},{"$f":"CALENDAR!I8","v":""},{"$f":"CALENDAR!J8","v":"00:00:00"},{"$f":"CALENDAR!K8","v":"00:00:00"},{"$f":"CALENDAR!L8","v":""},{"$f":"CALENDAR!M8","v":"00:00:00"},{"$f":"CALENDAR!N8","v":"00:00:00"},{"$f":"CALENDAR!O8","v":""},{"$f":"CALENDAR!P8","v":"00:00:00"},{"$f":"CALENDAR!Q8","v":"00:00:00"},{"$f":"CALENDAR!R8","v":""},{"$f":"CALENDAR!S8","v":"00:00:00"},{"$f":"CALENDAR!T8","v":"00:00:00"},{"$f":"CALENDAR!U8","v":""}]
[null,null,{"$f":"CALENDAR!C9","v":""},{"$f":"CALENDAR!D9","v":0},{"$f":"CALENDAR!E9","v":0},{"$f":"CALENDAR!F9","v":""},{"$f":"CALENDAR!G9","v":0},{"$f":"CALENDAR!H9","v":0},{"$f":"CALENDAR!I9","v":""},{"$f":"CALENDAR!J9","v":0},{"$f":"CALENDAR!K9","v":0},{"$f":"CALENDAR!L9","v":""},{"$f":"CALENDAR!M9","v":0},{"$f":"CALENDAR!N9","v":0},{"$f":"CALENDAR!O9","v":""},{"$f":"CALENDAR!P9","v":0},{"$f":"CALENDAR!Q9","v":0},{"$f":"CALENDAR!R9","v":""},{"$f":"CALENDAR!S9","v":0},{"$f":"CALENDAR!T9","v":0},{"$f":"CALENDAR!U9","v":""}]
[null,null,{"$f":"CALENDAR!C10","v":""},{"$f":"CALENDAR!D10","v":0},{"$f":"CALENDAR!E10","v":0},{"$f":"CALENDAR!F10","v":""},{"$f":"CALENDAR!G10","v":0},{"$f":"CALENDAR!H10","v":0},{"$f":"CALENDAR!I10","v":""},{"$f":"CALENDAR!J10","v":0},{"$f":"CALENDAR!K10","v":0},{"$f":"CALENDAR!L10","v":""},{"$f":"CALENDAR!M10","v":0},{"$f":"CALENDAR!N10","v":0},{"$f":"CALENDAR!O10","v":""},{"$f":"CALENDAR!P10","v":0},{"$f":"CALENDAR!Q10","v":0},{"$f":"CALENDAR!R10","v":""},{"$f":"CALENDAR!S10","v":0},{"$f":"CALENDAR!T10","v":0},{"$f":"CALENDAR!U10","v":""}]
[null,null,{"$f":"CALENDAR!C11","v":"2017-04-02"},{"$f":"CALENDAR!D11","v":0},{"$f":"CALENDAR!E11","v":0},{"$f":"CALENDAR!F11","v":"2017-04-03"},{"$f":"CALENDAR!G11","v":0},{"$f":"CALENDAR!H11","v":0},{"$f":"CALENDAR!I11","v":"2017-04-04"},{"$f":"CALENDAR!J11","v":0},{"$f":"CALENDAR!K11","v":0},{"$f":"CALENDAR!L11","v":"2017-04-05"},{"$f":"CALENDAR!M11","v":0},{"$f":"CALENDAR!N11","v":0},{"$f":"CALENDAR!O11","v":"2017-04-06"},{"$f":"CALENDAR!P11","v":0},{"$f":"CALENDAR!Q11","v":0},{"$f":"CALENDAR!R11","v":"2017-04-07"},{"$f":"CALENDAR!S11","v":0},{"$f":"CALENDAR!T11","v":0},{"$f":"CALENDAR!U11","v":"2017-04-08"}]
[null,null,{"$f":"CALENDAR!C12","v":""},{"$f":"CALENDAR!D12","v":0},{"$f":"CALENDAR!E12","v":0},{"$f":"CALENDAR!F12","v":""},{"$f":"CALENDAR!G12","v":0},{"$f":"CALENDAR!H12","v":0},{"$f":"CALENDAR!I12","v":""},{"$f":"CALENDAR!J12","v":0},{"$f":"CALENDAR!K12","v":0},{"$f":"CALENDAR!L12","v":""},{"$f":"CALENDAR!M12","v":0},{"$f":"CALENDAR!N12","v":0},{"$f":"CALENDAR!O12","v":""},{"$f":"CALENDAR!P12","v":0},{"$f":"CALENDAR!Q12","v":0},{"$f":"CALENDAR!R12","v":""},{"$f":"CALENDAR!S12","v":0},{"$f":"CALENDAR!T12","v":0},{"$f":"CALENDAR!U12","v":""}]
[null,null,{"$f":"CALENDAR!C13","v":""},{"$f":"CALENDAR!D13","v":0},{"$f":"CALENDAR!E13","v":0},{"$f":"CALENDAR!F13","v":""},{"$f":"CALENDAR!G13","v":0},{"$f":"CALENDAR!H13","v":0},{"$f":"CALENDAR!I13","v":""},{"$f":"CALENDAR!J13","v":0},{"$f":"CALENDAR!K13","v":0},{"$f":"CALENDAR!L13","v":""},{"$f":"CALENDAR!M13","v":0},{"$f":"CALENDAR!N13","v":0},{"$f":"CALENDAR!O13","v":""},{"$f":"CALENDAR!P13","v":0},{"$f":"CALENDAR!Q13","v":0},{"$f":"CALENDAR!R13","v":""},{"$f":"CALENDAR!S13","v":0},{"$f":"CALENDAR!T13","v":0},{"$f":"CALENDAR!U13","v":""}]
[null,null,{"$f":"CALENDAR!C14","v":""},{"$f":"CALENDAR!D14","v":0},{"$f":"CALENDAR!E14","v":0},{"$f":"CALENDAR!F14","v":""},{"$f":"CALENDAR!G14","v":0},{"$f":"CALENDAR!H14","v":0},{"$f":"CALENDAR!I14","v":""},{"$f":"CALENDAR!J14","v":0},{"$f":"CALENDAR!K14","v":0},{"$f":"CALENDAR!L14","v":""},{"$f":"CALENDAR!M14","v":0},{"$f":"CALENDAR!N14","v":0},{"$f":"CALENDAR!O14","v":""},{"$f":"CALENDAR!P14","v":0},{"$f":"CALENDAR!Q14","v":0},{"$f":"CALENDAR!R14","v":""},{"$f":"CALENDAR!S14","v":0},{"$f":"CALENDAR!T14","v":0},{"$f":"CALENDAR!U14","v":""}]
[null,null,{"$f":"CALENDAR!C15","v":""},{"$f":"CALENDAR!D15","v":0},{"$f":"CALENDAR!E15","v":0},{"$f":"CALENDAR!F15","v":""},{"$f":"CALENDAR!G15","v":0},{"$f":"CALENDAR!H15","v":0},{"$f":"CALENDAR!I15","v":""},{"$f":"CALENDAR!J15","v":0},{"$f":"CALENDAR!K15","v":0},{"$f":"CALENDAR!L15","v":""},{"$f":"CALENDAR!M15","v":0},{"$f":"CALENDAR!N15","v":0},{"$f":"CALENDAR!O15","v":""},{"$f":"CALENDAR!P15","v":0},{"$f":"CALENDAR!Q15","v":0},{"$f":"CALENDAR!R15","v":""},{"$f":"CALENDAR!S15","v":0},{"$f":"CALENDAR!T15","v":0},{"$f":"CALENDAR!U15","v":""}]
[null,null,{"$f":"CALENDAR!C16","v":"2017-04-09"},{"$f":"CALENDAR!D16","v":0},{"$f":"CALENDAR!E16","v":0},{"$f":"CALENDAR!F16","v":"2017-04-10"},{"$f":"CALENDAR!G16","v":0},{"$f":"CALENDAR!H16","v":0},{"$f":"CALENDAR!I16","v":"2017-04-11"},{"$f":"CALENDAR!J16","v":0},{"$f":"CALENDAR!K16","v":0},{"$f":"CALENDAR!L16","v":"2017-04-12"},{"$f":"CALENDAR!M16","v":0},{"$f":"CALENDAR!N16","v":0},{"$f":"CALENDAR!O16","v":"2017-04-13"},{"$f":"CALENDAR!P16","v":0},{"$f":"CALENDAR!Q16","v":0},{"$f":"CALENDAR!R16","v":"2017-04-14"},{"$f":"CALENDAR!S16","v":0},{"$f":"CALENDAR!T16","v":0},{"$f":"CALENDAR!U16","v":"2017-04-15"}]
[null,null,{"$f":"CALENDAR!C17","v":""},{"$f":"CALENDAR!D17","v":0},{"$f":"CALENDAR!E17","v":0},{"$f":"CALENDAR!F17","v":""},{"$f":"CALENDAR!G17","v":0},{"$f":"CALENDAR!H17","v":0},{"$f":"CALENDAR!I17","v":""},{"$f":"CALENDAR!J17","v":0},{"$f":"CALENDAR!K17","v":0},{"$f":"CALENDAR!L17","v":""},{"$f":"CALENDAR!M17","v":0},{"$f":"CALENDAR!N17","v":0},{"$f":"CALENDAR!O17","v":""},{"$f":"CALENDAR!P17","v":0},{"$f":"CALENDAR!Q17","v":0},{"$f":"CALENDAR!R17","v":""},{"$f":"CALENDAR!S17","v":0},{"$f":"CALENDAR!T17","v":0},{"$f":"CALENDAR!U17","v":""}]
[null,null,{"$f":"CALENDAR!C18","v":""},{"$f":"CALENDAR!D18","v":0},{"$f":"CALENDAR!E18","v":0},{"$f":"CALENDAR!F18","v":""},{"$f":"CALENDAR!G18","v":0},{"$f":"CALENDAR!H18","v":0},{"$f":"CALENDAR!I18","v":""},{"$f":"CALENDAR!J18","v":0},{"$f":"CALENDAR!K18","v":0},{"$f":"CALENDAR!L18","v":""},{"$f":"CALENDAR!M18","v":0},{"$f":"CALENDAR!N18","v":0},{"$f":"CALENDAR!O18","v":""},{"$f":"CALENDAR!P18","v":0},{"$f":"CALENDAR!Q18","v":0},{"$f":"CALENDAR!R18","v":""},{"$f":"CALENDAR!S18","v":0},{"$f":"CALENDAR!T18","v":0},{"$f":"CALENDAR!U18","v":""}]
[null,null,{"$f":"CALENDAR!C19","v":""},{"$f":"CALENDAR!D19","v":0},{"$f":"CALENDAR!E19","v":0},{"$f":"CALENDAR!F19","v":""},{"$f":"CALENDAR!G19","v":0},{"$f":"CALENDAR!H19","v":0},{"$f":"CALENDAR!I19","v":""},{"$f":"CALENDAR!J19","v":0},{"$f":"CALENDAR!K19","v":0},{"$f":"CALENDAR!L19","v":""},{"$f":"CALENDAR!M19","v":0},{"$f":"CALENDAR!N19","v":0},{"$f":"CALENDAR!O19","v":""},{"$f":"CALENDAR!P19","v":0},{"$f":"CALENDAR!Q19","v":0},{"$f":"CALENDAR!R19","v":""},{"$f":"CALENDAR!S19","v":0},{"$f":"CALENDAR!T19","v":0},{"$f":"CALENDAR!U19","v":""}]
[null,null,{"$f":"CALENDAR!C20","v":""},{"$f":"CALENDAR!D20","v":0},{"$f":"CALENDAR!E20","v":0},{"$f":"CALENDAR!F20","v":""},{"$f":"CALENDAR!G20","v":0},{"$f":"CALENDAR!H20","v":0},{"$f":"CALENDAR!I20","v":""},{"$f":"CALENDAR!J20","v":0},{"$f":"CALENDAR!K20","v":0},{"$f":"CALENDAR!L20","v":""},{"$f":"CALENDAR!M20","v":0},{"$f":"CALENDAR!N20","v":0},{"$f":"CALENDAR!O20","v":""},{"$f":"CALENDAR!P20","v":0},{"$f":"CALENDAR!Q20","v":0},{"$f":"CALENDAR!R20","v":""},{"$f":"CALENDAR!S20","v":0},{"$f":"CALENDAR!T20","v":0},{"$f":"CALENDAR!U20","v":""}]
{"$rows_left_out":16}
{"sheet":"Months","index":4,"n_rows":14,"n_cols":3,"rows_kept":14,"cut":false,"hidden":true,"merged":[]}
[]
[null,"MONTH","NUMBER"]
[null,"JANUARY",1]
[null,"FEBRUARY",2]
[null,"MARCH",3]
[null,"APRIL",4]
[null,"MAY",5]
[null,"JUNE",6]
[null,"JULY",7]
[null,"AUGUST",8]
[null,"SEPTEMBER",9]
[null,"OCTOBER",10]
[null,"NOVEMBER",11]
[null,"DECEMBER",12]